Information card for entry 4127815
Formula | C26 H31 B N2 O4 |
Calculated formula | C26 H31 B N2 O4 |
SMILES | [B@H]1(=C2N(C=CN2c2c(cc(cc2C)C)C)c2c(cc(cc2C)C)C)[C@@H](CC(=O)O1)C(=O)OC.[B@@H]1(=C2N(C=CN2c2c(cc(cc2C)C)C)c2c(cc(cc2C)C)C)[C@H](CC(=O)O1)C(=O)OC |
Title of publication | Ring-Opening Reactions of NHC-Boriranes with In Situ Generated HCl: Synthesis of a New Class of NHC-Boralactones. |
Authors of publication | Dai, Wen; Geib, Steven J.; Curran, Dennis P. |
Journal of publication | Journal of the American Chemical Society |
Year of publication | 2019 |
Journal volume | 141 |
Journal issue | 8 |
Pages of publication | 3623 - 3629 |
a | 14.5624 ± 0.0006 Å |
b | 18.4649 ± 0.0007 Å |
c | 38.235 ± 0.0015 Å |
α | 90° |
β | 90° |
γ | 90° |
Cell volume | 10281.1 ± 0.7 Å3 |
Cell temperature | 230 ± 2 K |
Ambient diffraction temperature | 230 ± 2 K |
Number of distinct elements | 5 |
Space group number | 61 |
Hermann-Mauguin space group symbol | P b c a |
Hall space group symbol | -P 2ac 2ab |
Residual factor for all reflections | 0.0697 |
Residual factor for significantly intense reflections | 0.0496 |
Weighted residual factors for significantly intense reflections | 0.1441 |
Weighted residual factors for all reflections included in the refinement | 0.1561 |
Goodness-of-fit parameter for all reflections included in the refinement | 1.443 |
Diffraction radiation wavelength | 1.54178 Å |
Diffraction radiation type | CuKα |