Information card for entry 4127817
Formula | C14 H23 B N2 O4 |
Calculated formula | C14 H23 B N2 O4 |
SMILES | O1[B@H](=C2N(C=CN2C(C)C)C(C)C)[C@@H](CC1=O)C(=O)OC.O1[B@@H](=C2N(C=CN2C(C)C)C(C)C)[C@H](CC1=O)C(=O)OC |
Title of publication | Ring-Opening Reactions of NHC-Boriranes with In Situ Generated HCl: Synthesis of a New Class of NHC-Boralactones. |
Authors of publication | Dai, Wen; Geib, Steven J.; Curran, Dennis P. |
Journal of publication | Journal of the American Chemical Society |
Year of publication | 2019 |
Journal volume | 141 |
Journal issue | 8 |
Pages of publication | 3623 - 3629 |
a | 18.2555 ± 0.0014 Å |
b | 10.0709 ± 0.0006 Å |
c | 9.1697 ± 0.0006 Å |
α | 90° |
β | 90° |
γ | 90° |
Cell volume | 1685.8 ± 0.2 Å3 |
Cell temperature | 230 ± 2 K |
Ambient diffraction temperature | 230 ± 2 K |
Number of distinct elements | 5 |
Space group number | 33 |
Hermann-Mauguin space group symbol | P n a 21 |
Hall space group symbol | P 2c -2n |
Residual factor for all reflections | 0.0712 |
Residual factor for significantly intense reflections | 0.0525 |
Weighted residual factors for significantly intense reflections | 0.1305 |
Weighted residual factors for all reflections included in the refinement | 0.1473 |
Goodness-of-fit parameter for all reflections included in the refinement | 1.052 |
Diffraction radiation wavelength | 1.54178 Å |
Diffraction radiation type | CuKα |