Information card for entry 4127827
Formula | C66 H152 N16 P4 Tb |
Calculated formula | C66 H152 N16 P4 Tb |
Title of publication | Design, Isolation, and Spectroscopic Analysis of a Tetravalent Terbium Complex. |
Authors of publication | Rice, Natalie T.; Popov, Ivan A.; Russo, Dominic R.; Bacsa, John; Batista, Enrique R.; Yang, Ping; Telser, Joshua; La Pierre, Henry S. |
Journal of publication | Journal of the American Chemical Society |
Year of publication | 2019 |
Journal volume | 141 |
Journal issue | 33 |
Pages of publication | 13222 - 13233 |
a | 13.2756 ± 0.0008 Å |
b | 13.2756 ± 0.0008 Å |
c | 21.077 ± 0.003 Å |
α | 90° |
β | 90° |
γ | 90° |
Cell volume | 3714.6 ± 0.6 Å3 |
Cell temperature | 107 ± 2 K |
Ambient diffraction temperature | 107.43 K |
Number of distinct elements | 5 |
Space group number | 82 |
Hermann-Mauguin space group symbol | I -4 |
Hall space group symbol | I -4 |
Residual factor for all reflections | 0.0375 |
Residual factor for significantly intense reflections | 0.0362 |
Weighted residual factors for significantly intense reflections | 0.0721 |
Weighted residual factors for all reflections included in the refinement | 0.073 |
Goodness-of-fit parameter for all reflections included in the refinement | 1.052 |
Diffraction radiation wavelength | 0.71073 Å |
Diffraction radiation type | MoKα |