Information card for entry 4127838
Formula | C64 H70 B F20 Tb |
Calculated formula | C64 H70 B F20 Tb |
Title of publication | Synthesis and Magnetism of Neutral, Linear Metallocene Complexes of Terbium(II) and Dysprosium(II). |
Authors of publication | Gould, Colin A.; McClain, K. Randall; Yu, Jason M.; Groshens, Thomas J.; Furche, Filipp; Harvey, Benjamin G.; Long, Jeffrey R. |
Journal of publication | Journal of the American Chemical Society |
Year of publication | 2019 |
Journal volume | 141 |
Journal issue | 33 |
Pages of publication | 12967 - 12973 |
a | 15.2155 ± 0.0006 Å |
b | 23.1873 ± 0.0009 Å |
c | 16.8829 ± 0.0007 Å |
α | 90° |
β | 90.943 ± 0.001° |
γ | 90° |
Cell volume | 5955.6 ± 0.4 Å3 |
Cell temperature | 100 ± 2 K |
Ambient diffraction temperature | 100 ± 1 K |
Number of distinct elements | 5 |
Space group number | 14 |
Hermann-Mauguin space group symbol | P 1 21/n 1 |
Hall space group symbol | -P 2yn |
Residual factor for all reflections | 0.0716 |
Residual factor for significantly intense reflections | 0.0563 |
Weighted residual factors for significantly intense reflections | 0.1506 |
Weighted residual factors for all reflections included in the refinement | 0.1632 |
Goodness-of-fit parameter for all reflections included in the refinement | 1.018 |
Diffraction radiation wavelength | 0.71073 Å |
Diffraction radiation type | MoKα |