Information card for entry 4127879
Formula | C20 H26 N O3 Rh |
Calculated formula | C20 H26 N O3 Rh |
Title of publication | Flow Rhodaelectro-Catalyzed Alkyne Annulations by Versatile C-H Activation: Mechanistic Support for Rhodium(III/IV). |
Authors of publication | Kong, Wei-Jun; Finger, Lars H.; Messinis, Antonis M.; Kuniyil, Rositha; Oliveira, João C A; Ackermann, Lutz |
Journal of publication | Journal of the American Chemical Society |
Year of publication | 2019 |
Journal volume | 141 |
Journal issue | 43 |
Pages of publication | 17198 - 17206 |
a | 12.3525 ± 0.0004 Å |
b | 10.3586 ± 0.0004 Å |
c | 14.6863 ± 0.0005 Å |
α | 90° |
β | 90.724 ± 0.001° |
γ | 90° |
Cell volume | 1879.03 ± 0.11 Å3 |
Cell temperature | 100 K |
Ambient diffraction temperature | 100.01 K |
Number of distinct elements | 5 |
Space group number | 14 |
Hermann-Mauguin space group symbol | P 1 21/c 1 |
Hall space group symbol | -P 2ybc |
Residual factor for all reflections | 0.0173 |
Residual factor for significantly intense reflections | 0.017 |
Weighted residual factors for significantly intense reflections | 0.0437 |
Weighted residual factors for all reflections included in the refinement | 0.0438 |
Goodness-of-fit parameter for all reflections included in the refinement | 1.113 |
Diffraction radiation wavelength | 0.71073 Å |
Diffraction radiation type | MoKα |