Information card for entry 4127882
Formula | Ba F Mn0.5 Te |
Calculated formula | Ba F Mn0.5 Te |
Title of publication | Antiferromagnetic Semiconductor BaFMn<sub>0.5</sub>Te with Unique Mn Ordering and Red Photoluminescence. |
Authors of publication | Chen, Haijie; McClain, Rebecca; He, Jiangang; Zhang, Chi; Olding, Jack N.; Dos Reis, Roberto; Bao, Jin-Ke; Hadar, Ido; Spanopoulos, Ioannis; Malliakas, Christos D.; He, Yihui; Chung, Duck Young; Kwok, Wai-Kwong; Weiss, Emily A.; Dravid, Vinayak P.; Wolverton, Christopher; Kanatzidis, Mercouri G. |
Journal of publication | Journal of the American Chemical Society |
Year of publication | 2019 |
Journal volume | 141 |
Journal issue | 43 |
Pages of publication | 17421 - 17430 |
a | 4.4704 ± 0.0006 Å |
b | 4.4704 ± 0.0006 Å |
c | 9.634 ± 0.0017 Å |
α | 90° |
β | 90° |
γ | 90° |
Cell volume | 192.53 ± 0.05 Å3 |
Cell temperature | 293 K |
Ambient diffraction temperature | 293 K |
Number of distinct elements | 4 |
Space group number | 129 |
Hermann-Mauguin space group symbol | P 4/n m m :1 |
Hall space group symbol | P 4ab 2ab -1ab |
Residual factor for all reflections | 0.0484 |
Residual factor for significantly intense reflections | 0.0468 |
Weighted residual factors for significantly intense reflections | 0.1366 |
Weighted residual factors for all reflections included in the refinement | 0.1368 |
Goodness-of-fit parameter for significantly intense reflections | 5.87 |
Goodness-of-fit parameter for all reflections included in the refinement | 5.61 |
Diffraction radiation probe | x-ray |
Diffraction radiation wavelength | 0.71073 Å |
Diffraction radiation type | MoKα |