Information card for entry 4127887
Formula | C20 H21 N3 Ni O |
Calculated formula | C20 H21 N3 Ni O |
SMILES | [Ni]12([n]3cccc4cccc(c34)N1C(=O)C(C2)(C)C)[n]1ccc(cc1)C |
Title of publication | Catalytically Relevant Intermediates in the Ni-Catalyzed C(sp<sup>2</sup>)-H and C(sp<sup>3</sup>)-H Functionalization of Aminoquinoline Substrates. |
Authors of publication | Roy, Pronay; Bour, James R.; Kampf, Jeff W.; Sanford, Melanie S. |
Journal of publication | Journal of the American Chemical Society |
Year of publication | 2019 |
Journal volume | 141 |
Journal issue | 43 |
Pages of publication | 17382 - 17387 |
a | 9.9239 ± 0.0003 Å |
b | 10.4834 ± 0.0003 Å |
c | 17.205 ± 0.0004 Å |
α | 95.269 ± 0.002° |
β | 90.932 ± 0.002° |
γ | 93.893 ± 0.002° |
Cell volume | 1777.81 ± 0.09 Å3 |
Cell temperature | 85 ± 2 K |
Ambient diffraction temperature | 85 ± 2 K |
Number of distinct elements | 5 |
Space group number | 2 |
Hermann-Mauguin space group symbol | P -1 |
Hall space group symbol | -P 1 |
Residual factor for all reflections | 0.0385 |
Residual factor for significantly intense reflections | 0.0373 |
Weighted residual factors for significantly intense reflections | 0.1018 |
Weighted residual factors for all reflections included in the refinement | 0.1041 |
Goodness-of-fit parameter for all reflections included in the refinement | 1.014 |
Diffraction radiation wavelength | 1.54184 Å |
Diffraction radiation type | CuKα |