Information card for entry 4127892
Formula | C29.7 H43.3 N3.9 O14.9 S2 Zn4 |
Calculated formula | C24 H30 N2 O12 S2 Zn4 |
Title of publication | Tuning the Molecular and Cationic Affinity in a Series of Multifunctional Metal-Organic Frameworks Based on Dodecanuclear Zn(II) Carboxylate Wheels. |
Authors of publication | Lysova, Anna A.; Samsonenko, Denis G.; Dorovatovskii, Pavel V.; Lazarenko, Vladimir A.; Khrustalev, Victor N.; Kovalenko, Konstantin A.; Dybtsev, Danil N.; Fedin, Vladimir P. |
Journal of publication | Journal of the American Chemical Society |
Year of publication | 2019 |
Journal volume | 141 |
Journal issue | 43 |
Pages of publication | 17260 - 17269 |
a | 31.7683 ± 0.0006 Å |
b | 31.7683 ± 0.0006 Å |
c | 11.8414 ± 0.0004 Å |
α | 90° |
β | 90° |
γ | 120° |
Cell volume | 10349.6 ± 0.4 Å3 |
Cell temperature | 100 ± 2 K |
Ambient diffraction temperature | 100 ± 2 K |
Number of distinct elements | 6 |
Space group number | 166 |
Hermann-Mauguin space group symbol | R -3 m :H |
Hall space group symbol | -R 3 2" |
Residual factor for all reflections | 0.0897 |
Residual factor for significantly intense reflections | 0.0774 |
Weighted residual factors for significantly intense reflections | 0.207 |
Weighted residual factors for all reflections included in the refinement | 0.2213 |
Goodness-of-fit parameter for all reflections included in the refinement | 1.022 |
Diffraction radiation wavelength | 0.80246 Å |
Diffraction radiation type | synchrotron |