Information card for entry 4127894
Formula | C27 H43 N3 O19 S2 Zn4 |
Calculated formula | C24 H21 N2 O14 S2 Zn4 |
Title of publication | Tuning the Molecular and Cationic Affinity in a Series of Multifunctional Metal-Organic Frameworks Based on Dodecanuclear Zn(II) Carboxylate Wheels. |
Authors of publication | Lysova, Anna A.; Samsonenko, Denis G.; Dorovatovskii, Pavel V.; Lazarenko, Vladimir A.; Khrustalev, Victor N.; Kovalenko, Konstantin A.; Dybtsev, Danil N.; Fedin, Vladimir P. |
Journal of publication | Journal of the American Chemical Society |
Year of publication | 2019 |
Journal volume | 141 |
Journal issue | 43 |
Pages of publication | 17260 - 17269 |
a | 32.0133 ± 0.0005 Å |
b | 32.0133 ± 0.0005 Å |
c | 11.7265 ± 0.0003 Å |
α | 90° |
β | 90° |
γ | 120° |
Cell volume | 10407.8 ± 0.4 Å3 |
Cell temperature | 100 ± 2 K |
Ambient diffraction temperature | 100 ± 2 K |
Number of distinct elements | 6 |
Space group number | 166 |
Hermann-Mauguin space group symbol | R -3 m :H |
Hall space group symbol | -R 3 2" |
Residual factor for all reflections | 0.0819 |
Residual factor for significantly intense reflections | 0.0604 |
Weighted residual factors for significantly intense reflections | 0.1876 |
Weighted residual factors for all reflections included in the refinement | 0.205 |
Goodness-of-fit parameter for all reflections included in the refinement | 1.12 |
Diffraction radiation wavelength | 0.80246 Å |
Diffraction radiation type | synchrotron |