Information card for entry 4127903
Formula | C20 H18 O3 |
Calculated formula | C20 H18 O3 |
SMILES | o1c2ccccc2c2c3ccccc3OC(=O)[C@H](Cc12)CCC |
Title of publication | Diastereo- and Atroposelective Synthesis of Bridged Biaryls Bearing an Eight-Membered Lactone through an Organocatalytic Cascade. |
Authors of publication | Lu, Shenci; Ong, Jun-Yang; Yang, Hui; Poh, Si Bei; Liew, Xi; Seow, Chwee San Deborah; Wong, Ming Wah; Zhao, Yu |
Journal of publication | Journal of the American Chemical Society |
Year of publication | 2019 |
Journal volume | 141 |
Journal issue | 43 |
Pages of publication | 17062 - 17067 |
a | 11.9855 ± 0.0013 Å |
b | 7.8837 ± 0.0009 Å |
c | 16.321 ± 0.0018 Å |
α | 90° |
β | 90.079 ± 0.002° |
γ | 90° |
Cell volume | 1542.2 ± 0.3 Å3 |
Cell temperature | 100 ± 2 K |
Ambient diffraction temperature | 100 ± 2 K |
Number of distinct elements | 3 |
Space group number | 4 |
Hermann-Mauguin space group symbol | P 1 21 1 |
Hall space group symbol | P 2yb |
Residual factor for all reflections | 0.033 |
Residual factor for significantly intense reflections | 0.0327 |
Weighted residual factors for significantly intense reflections | 0.0828 |
Weighted residual factors for all reflections included in the refinement | 0.087 |
Goodness-of-fit parameter for all reflections included in the refinement | 1.072 |
Diffraction radiation wavelength | 1.54178 Å |
Diffraction radiation type | CuKα |