Information card for entry 4127927
Formula | C86 H81 N11 O17 |
Calculated formula | C86 H81 N11 O17 |
SMILES | O=C(O)c1ccc(c2cc3nc4c(nc3cc2c2ccc(cc2)C(=O)O)c2nc3cc(c(cc3nc2c2nc3cc(c(cc3nc42)c2ccc(cc2)C(=O)O)c2ccc(cc2)C(=O)O)c2ccc(cc2)C(=O)O)c2ccc(cc2)C(=O)O)cc1.O=C(N(C)C)C.O=C(N(C)C)C.O=C(N(C)C)C.O=C(N(C)C)C.O=C(N(C)C)C |
Title of publication | Acid Responsive Hydrogen-Bonded Organic Frameworks. |
Authors of publication | Hisaki, Ichiro; Suzuki, Yuto; Gomez, Eduardo; Ji, Qin; Tohnai, Norimitsu; Nakamura, Takayoshi; Douhal, Abderrazzak |
Journal of publication | Journal of the American Chemical Society |
Year of publication | 2019 |
Journal volume | 141 |
Journal issue | 5 |
Pages of publication | 2111 - 2121 |
a | 7.55733 ± 0.00014 Å |
b | 20.5126 ± 0.0007 Å |
c | 26.9565 ± 0.0009 Å |
α | 71.418 ± 0.003° |
β | 83.519 ± 0.002° |
γ | 82.56 ± 0.002° |
Cell volume | 3916.2 ± 0.2 Å3 |
Cell temperature | 213 K |
Ambient diffraction temperature | 213 K |
Number of distinct elements | 4 |
Space group number | 2 |
Hermann-Mauguin space group symbol | P -1 |
Hall space group symbol | -P 1 |
Residual factor for all reflections | 0.0578 |
Residual factor for significantly intense reflections | 0.0465 |
Weighted residual factors for significantly intense reflections | 0.1248 |
Weighted residual factors for all reflections included in the refinement | 0.1323 |
Goodness-of-fit parameter for all reflections included in the refinement | 1.047 |
Diffraction radiation wavelength | 1.54187 Å |
Diffraction radiation type | CuKα |