Information card for entry 4127952
Formula | C14 H9 Cl4 F |
Calculated formula | C14 H9 Cl4 F |
Title of publication | Manipulating Solid Forms of Contact Insecticides for Infectious Disease Prevention. |
Authors of publication | Zhu, Xiaolong; Hu, Chunhua T.; Yang, Jingxiang; Joyce, Leo A.; Qiu, Mengdi; Ward, Michael D.; Kahr, Bart |
Journal of publication | Journal of the American Chemical Society |
Year of publication | 2019 |
Journal volume | 141 |
Journal issue | 42 |
Pages of publication | 16858 - 16864 |
a | 9.6421 ± 0.0005 Å |
b | 9.6762 ± 0.0005 Å |
c | 16.3543 ± 0.0009 Å |
α | 94.296 ± 0.001° |
β | 103.025 ± 0.001° |
γ | 107.253 ± 0.001° |
Cell volume | 1403.12 ± 0.13 Å3 |
Cell temperature | 100 ± 2 K |
Ambient diffraction temperature | 100 ± 2 K |
Number of distinct elements | 4 |
Space group number | 2 |
Hermann-Mauguin space group symbol | P -1 |
Hall space group symbol | -P 1 |
Residual factor for all reflections | 0.0454 |
Residual factor for significantly intense reflections | 0.0373 |
Weighted residual factors for significantly intense reflections | 0.0894 |
Weighted residual factors for all reflections included in the refinement | 0.0935 |
Goodness-of-fit parameter for all reflections included in the refinement | 1.04 |
Diffraction radiation wavelength | 0.71073 Å |
Diffraction radiation type | MoKα |