Information card for entry 4127967
Formula | C34 H50 Al N2 P |
Calculated formula | C34 H50 Al N2 P |
SMILES | [Al]12([P]#[C]2C(C)(C)C)[N](c2c(C(C)C)cccc2C(C)C)=C(C=C(N1c1c(cccc1C(C)C)C(C)C)C)C |
Title of publication | Phosphaaluminirenes: Synthons for Main Group Heterocycles. |
Authors of publication | Liu, Liu Leo; Zhou, Jiliang; Cao, Levy L.; Stephan, Douglas W. |
Journal of publication | Journal of the American Chemical Society |
Year of publication | 2019 |
Journal volume | 141 |
Journal issue | 42 |
Pages of publication | 16971 - 16982 |
a | 10.3031 ± 0.0006 Å |
b | 19.9676 ± 0.0012 Å |
c | 15.9668 ± 0.0011 Å |
α | 90° |
β | 97.155 ± 0.002° |
γ | 90° |
Cell volume | 3259.2 ± 0.4 Å3 |
Cell temperature | 150 ± 2 K |
Ambient diffraction temperature | 150 ± 2 K |
Number of distinct elements | 5 |
Space group number | 14 |
Hermann-Mauguin space group symbol | P 1 21/n 1 |
Hall space group symbol | -P 2yn |
Residual factor for all reflections | 0.0852 |
Residual factor for significantly intense reflections | 0.0456 |
Weighted residual factors for significantly intense reflections | 0.0954 |
Weighted residual factors for all reflections included in the refinement | 0.1088 |
Goodness-of-fit parameter for all reflections included in the refinement | 1.025 |
Diffraction radiation wavelength | 0.71073 Å |
Diffraction radiation type | MoKα |