Information card for entry 4127979
Formula | C32 H24 F N O2 S |
Calculated formula | C32 H24 F N O2 S |
SMILES | S(=O)(=O)(n1cc2c(c1)[C@@]1([C@H](c3c2cccc3)[C@H]1c1ccccc1)c1ccc(F)cc1)c1ccc(C)cc1 |
Title of publication | Generation of Donor/Donor Copper Carbenes through Copper-Catalyzed Diyne Cyclization: Enantioselective and Divergent Synthesis of Chiral Polycyclic Pyrroles. |
Authors of publication | Hong, Feng-Lin; Wang, Ze-Shu; Wei, Dong-Dong; Zhai, Tong-Yi; Deng, Guo-Cheng; Lu, Xin; Liu, Rai-Shung; Ye, Long-Wu |
Journal of publication | Journal of the American Chemical Society |
Year of publication | 2019 |
Journal volume | 141 |
Journal issue | 42 |
Pages of publication | 16961 - 16970 |
a | 10.4082 ± 0.0001 Å |
b | 13.6167 ± 0.0001 Å |
c | 18.5933 ± 0.0002 Å |
α | 90° |
β | 90° |
γ | 90° |
Cell volume | 2635.14 ± 0.04 Å3 |
Cell temperature | 293 ± 2 K |
Ambient diffraction temperature | 293 ± 2 K |
Number of distinct elements | 6 |
Space group number | 19 |
Hermann-Mauguin space group symbol | P 21 21 21 |
Hall space group symbol | P 2ac 2ab |
Residual factor for all reflections | 0.0328 |
Residual factor for significantly intense reflections | 0.0311 |
Weighted residual factors for significantly intense reflections | 0.0862 |
Weighted residual factors for all reflections included in the refinement | 0.0877 |
Goodness-of-fit parameter for all reflections included in the refinement | 1.051 |
Diffraction radiation probe | x-ray |
Diffraction radiation wavelength | 1.54184 Å |
Diffraction radiation type | CuKα |