Information card for entry 4127981
Common name | [LCo2K(C5H11N)2(MeO)2(MeOH)2](CF3SO3)(MeOH)2.5(Et2O) |
Formula | C61.5 H80 Co2 F3 K N6 O16.5 S |
Calculated formula | C61.5 H80 Co2 F3 K N6 O16.5 S |
Title of publication | Switching of <i>Recognition First</i> and <i>Reaction First</i> Mechanisms in Host-Guest Binding Associated with Chemical Reactions. |
Authors of publication | Sakata, Yoko; Tamiya, Munehiro; Okada, Masahiro; Akine, Shigehisa |
Journal of publication | Journal of the American Chemical Society |
Year of publication | 2019 |
Journal volume | 141 |
Journal issue | 39 |
Pages of publication | 15597 - 15604 |
a | 30.9242 ± 0.0009 Å |
b | 13.3451 ± 0.0004 Å |
c | 16.9298 ± 0.0005 Å |
α | 90° |
β | 108.846 ± 0.001° |
γ | 90° |
Cell volume | 6612.1 ± 0.3 Å3 |
Cell temperature | 90 K |
Ambient diffraction temperature | 90 K |
Number of distinct elements | 8 |
Space group number | 15 |
Hermann-Mauguin space group symbol | C 1 2/c 1 |
Hall space group symbol | -C 2yc |
Residual factor for all reflections | 0.0843 |
Residual factor for significantly intense reflections | 0.0718 |
Weighted residual factors for significantly intense reflections | 0.1934 |
Weighted residual factors for all reflections included in the refinement | 0.2059 |
Goodness-of-fit parameter for all reflections included in the refinement | 1.039 |
Diffraction radiation wavelength | 1.54178 Å |
Diffraction radiation type | CuKα |