Information card for entry 4127994
Formula | C37 H55 Mo O P2 Si |
Calculated formula | C37 H55 Mo O P2 Si |
Title of publication | CO Coupling Chemistry of a Terminal Mo Carbide: Sequential Addition of Proton, Hydride, and CO Releases Ethenone. |
Authors of publication | Buss, Joshua A.; Bailey, Gwendolyn A.; Oppenheim, Julius; VanderVelde, David G.; Goddard, 3rd, William A; Agapie, Theodor |
Journal of publication | Journal of the American Chemical Society |
Year of publication | 2019 |
Journal volume | 141 |
Journal issue | 39 |
Pages of publication | 15664 - 15674 |
a | 11.6736 ± 0.0005 Å |
b | 12.0522 ± 0.0005 Å |
c | 14.3227 ± 0.0006 Å |
α | 94.987 ± 0.002° |
β | 105.434 ± 0.002° |
γ | 110.315 ± 0.002° |
Cell volume | 1785.4 ± 0.14 Å3 |
Cell temperature | 100 ± 2 K |
Ambient diffraction temperature | 100 K |
Number of distinct elements | 6 |
Space group number | 2 |
Hermann-Mauguin space group symbol | P -1 |
Hall space group symbol | -P 1 |
Residual factor for all reflections | 0.0412 |
Residual factor for significantly intense reflections | 0.0292 |
Weighted residual factors for significantly intense reflections | 0.0692 |
Weighted residual factors for all reflections included in the refinement | 0.0736 |
Goodness-of-fit parameter for all reflections included in the refinement | 1.044 |
Diffraction radiation wavelength | 0.71073 Å |
Diffraction radiation type | MoKα |