Information card for entry 4127997
Formula | C19 H26 O5 |
Calculated formula | C19 H26 O5 |
SMILES | C(=O)(C1=CCCCCC1c1c(OC)cc(OC)cc1OC)OCC |
Title of publication | Catalytic Cleavage of C(<i>sp</i><sup>2</sup>)-C(<i>sp</i><sup>2</sup>) Bonds with Rh-Carbynoids. |
Authors of publication | Wang, Zhaofeng; Jiang, Liyin; Sarró, Pau; Suero, Marcos G. |
Journal of publication | Journal of the American Chemical Society |
Year of publication | 2019 |
Journal volume | 141 |
Journal issue | 39 |
Pages of publication | 15509 - 15514 |
a | 11.0815 ± 0.0006 Å |
b | 18.8668 ± 0.001 Å |
c | 8.1309 ± 0.0005 Å |
α | 90° |
β | 92.8933 ± 0.0015° |
γ | 90° |
Cell volume | 1697.78 ± 0.17 Å3 |
Cell temperature | 100 ± 2 K |
Ambient diffraction temperature | 100 ± 2 K |
Number of distinct elements | 3 |
Space group number | 14 |
Hermann-Mauguin space group symbol | P 1 21/c 1 |
Hall space group symbol | -P 2ybc |
Residual factor for all reflections | 0.0591 |
Residual factor for significantly intense reflections | 0.0447 |
Weighted residual factors for significantly intense reflections | 0.1131 |
Weighted residual factors for all reflections included in the refinement | 0.122 |
Goodness-of-fit parameter for all reflections included in the refinement | 1.037 |
Diffraction radiation wavelength | 0.71073 Å |
Diffraction radiation type | MoKα |