Information card for entry 4128001
Formula | C92 H64 O4.76 Zn |
Calculated formula | C92 H64 O4.756 Zn |
Title of publication | One-Step Synthesis of an Adaptive Nanographene MOF: Adsorbed Gas-Dependent Geometrical Diversity. |
Authors of publication | Suginome, Shun; Sato, Hiroshi; Hori, Akihiro; Mishima, Akio; Harada, Yuki; Kusaka, Shinpei; Matsuda, Ryotaro; Pirillo, Jenny; Hijikata, Yuh; Aida, Takuzo |
Journal of publication | Journal of the American Chemical Society |
Year of publication | 2019 |
Journal volume | 141 |
Journal issue | 39 |
Pages of publication | 15649 - 15655 |
a | 19.145 ± 0.002 Å |
b | 19.421 ± 0.003 Å |
c | 20.42 ± 0.003 Å |
α | 79.032 ± 0.017° |
β | 63.984 ± 0.013° |
γ | 71.306 ± 0.015° |
Cell volume | 6452.2 ± 1.8 Å3 |
Cell temperature | 298 K |
Ambient diffraction temperature | 298 K |
Number of distinct elements | 4 |
Space group number | 2 |
Hermann-Mauguin space group symbol | P -1 |
Hall space group symbol | -P 1 |
Residual factor for all reflections | 0.1956 |
Residual factor for significantly intense reflections | 0.1167 |
Weighted residual factors for significantly intense reflections | 0.3285 |
Weighted residual factors for all reflections included in the refinement | 0.3778 |
Goodness-of-fit parameter for all reflections included in the refinement | 0.978 |
Diffraction radiation probe | x-ray |
Diffraction radiation wavelength | 0.71075 Å |
Diffraction radiation type | MoKα |