Information card for entry 4128005
Formula | C20 H14 N2 O2 |
Calculated formula | C20 H14 N2 O2 |
SMILES | O=C1N(c2ccccc2)C(=NC21C=CC(=O)C=C2)c1ccccc1 |
Title of publication | Generation of N-Centered Radicals via a Photocatalytic Energy Transfer: Remote Double Functionalization of Arenes Facilitated by Singlet Oxygen. |
Authors of publication | Soni, Vineet Kumar; Hwang, Ho Seong; Moon, Yu Kyung; Park, Sung-Woo; You, Youngmin; Cho, Eun Jin |
Journal of publication | Journal of the American Chemical Society |
Year of publication | 2019 |
Journal volume | 141 |
Journal issue | 26 |
Pages of publication | 10538 - 10545 |
a | 14.9596 ± 0.0005 Å |
b | 5.7704 ± 0.0002 Å |
c | 18.2738 ± 0.0005 Å |
α | 90° |
β | 93.348 ± 0.002° |
γ | 90° |
Cell volume | 1574.75 ± 0.09 Å3 |
Cell temperature | 298 ± 2 K |
Ambient diffraction temperature | 298 ± 2 K |
Number of distinct elements | 4 |
Space group number | 14 |
Hermann-Mauguin space group symbol | P 1 21/n 1 |
Hall space group symbol | -P 2yn |
Residual factor for all reflections | 0.0812 |
Residual factor for significantly intense reflections | 0.0451 |
Weighted residual factors for significantly intense reflections | 0.1228 |
Weighted residual factors for all reflections included in the refinement | 0.1506 |
Goodness-of-fit parameter for all reflections included in the refinement | 0.838 |
Diffraction radiation wavelength | 0.71073 Å |
Diffraction radiation type | MoKα |