Information card for entry 4128019
Formula | C63 H46 B F24 Ir N2 O3 |
Calculated formula | C63 H46 B F24 Ir N2 O3 |
Title of publication | Stereodefined Access to Lactams via Olefin Difunctionalization: Iridium Nitrenoids as a Motif of LUMO-Controlled Dipoles. |
Authors of publication | Hong, Seung Youn; Chang, Sukbok |
Journal of publication | Journal of the American Chemical Society |
Year of publication | 2019 |
Journal volume | 141 |
Journal issue | 26 |
Pages of publication | 10399 - 10408 |
a | 15.338 ± 0.003 Å |
b | 16.668 ± 0.003 Å |
c | 17.312 ± 0.003 Å |
α | 63.37 ± 0.03° |
β | 73.01 ± 0.03° |
γ | 78.05 ± 0.03° |
Cell volume | 3768.7 ± 1.6 Å3 |
Cell temperature | 298 ± 2 K |
Ambient diffraction temperature | 298 ± 2 K |
Number of distinct elements | 7 |
Space group number | 2 |
Hermann-Mauguin space group symbol | P -1 |
Hall space group symbol | -P 1 |
Residual factor for all reflections | 0.0404 |
Residual factor for significantly intense reflections | 0.0365 |
Weighted residual factors for significantly intense reflections | 0.1062 |
Weighted residual factors for all reflections included in the refinement | 0.1077 |
Goodness-of-fit parameter for all reflections included in the refinement | 1.214 |
Diffraction radiation wavelength | 0.7 Å |
Diffraction radiation type | synchrotron |