Information card for entry 4128030
Formula | Hg Li O4 P |
Calculated formula | Hg Li O4 P |
Title of publication | Highly Polarizable Hg<sup>2+</sup> Induced a Strong Second Harmonic Generation Signal and Large Birefringence in LiHgPO<sub>4</sub>. |
Authors of publication | Wu, Bao-Lin; Hu, Chun-Li; Mao, Fei-Fei; Tang, Ru-Ling; Mao, Jiang-Gao |
Journal of publication | Journal of the American Chemical Society |
Year of publication | 2019 |
Journal volume | 141 |
Journal issue | 26 |
Pages of publication | 10188 - 10192 |
a | 4.5946 ± 0.0004 Å |
b | 4.5946 ± 0.0004 Å |
c | 8.0512 ± 0.001 Å |
α | 90° |
β | 90° |
γ | 90° |
Cell volume | 169.96 ± 0.03 Å3 |
Cell temperature | 293 ± 2 K |
Ambient diffraction temperature | 293 ± 2 K |
Number of distinct elements | 4 |
Space group number | 113 |
Hermann-Mauguin space group symbol | P -4 21 m |
Hall space group symbol | P -4 2ab |
Residual factor for all reflections | 0.0337 |
Residual factor for significantly intense reflections | 0.029 |
Weighted residual factors for significantly intense reflections | 0.0522 |
Weighted residual factors for all reflections included in the refinement | 0.0576 |
Goodness-of-fit parameter for all reflections included in the refinement | 1.014 |
Diffraction radiation wavelength | 0.71073 Å |
Diffraction radiation type | MoKα |