Information card for entry 4128039
Formula | C84 H163 Cu6 N16 Ni4 O81 Pd2 |
Calculated formula | C84 H62 Cu6 N16 Ni4 O58 Pd2 |
Title of publication | Self-Assembly of Catalytically Active Supramolecular Coordination Compounds within Metal-Organic Frameworks. |
Authors of publication | Adam, Rosa; Mon, Marta; Greco, Rossella; Kalinke, Lucas H. G.; Vidal-Moya, Alejandro; Fernandez, Antonio; Winpenny, Richard E. P.; Doménech-Carbó, Antonio; Leyva-Pérez, Antonio; Armentano, Donatella; Pardo, Emilio; Ferrando-Soria, Jesús |
Journal of publication | Journal of the American Chemical Society |
Year of publication | 2019 |
Journal volume | 141 |
Journal issue | 26 |
Pages of publication | 10350 - 10360 |
a | 35.7158 ± 0.0002 Å |
b | 35.7158 ± 0.0002 Å |
c | 15.1495 ± 0.0001 Å |
α | 90° |
β | 90° |
γ | 90° |
Cell volume | 19325 ± 0.2 Å3 |
Cell temperature | 30 ± 2 K |
Ambient diffraction temperature | 30 ± 2 K |
Number of distinct elements | 7 |
Space group number | 123 |
Hermann-Mauguin space group symbol | P 4/m m m |
Hall space group symbol | -P 4 2 |
Residual factor for all reflections | 0.2909 |
Residual factor for significantly intense reflections | 0.1256 |
Weighted residual factors for significantly intense reflections | 0.4038 |
Weighted residual factors for all reflections included in the refinement | 0.4428 |
Goodness-of-fit parameter for all reflections included in the refinement | 1.036 |
Diffraction radiation wavelength | 0.6889 Å |
Diffraction radiation type | Synchrotron |