Information card for entry 4128045
Formula | C170.68 H116.03 Ce0.5 Co4 N36 O17.67 Zn3 |
Calculated formula | C170.676 H116.028 Ce0.5 Co4 N36 O17.676 Zn3 |
Title of publication | Synthesis of Hetero-multinuclear Metal Complexes by Site-Selective Redox Switching and Transmetalation on a Homo-multinuclear Complex. |
Authors of publication | Ube, Hitoshi; Endo, Kenichi; Sato, Hiroyasu; Shionoya, Mitsuhiko |
Journal of publication | Journal of the American Chemical Society |
Year of publication | 2019 |
Journal volume | 141 |
Journal issue | 26 |
Pages of publication | 10384 - 10389 |
a | 21.246 ± 0.0004 Å |
b | 21.246 ± 0.0004 Å |
c | 58.2102 ± 0.0012 Å |
α | 90° |
β | 90° |
γ | 120° |
Cell volume | 22755.4 ± 0.8 Å3 |
Cell temperature | 93 ± 2 K |
Ambient diffraction temperature | 93.15 K |
Number of distinct elements | 7 |
Space group number | 165 |
Hermann-Mauguin space group symbol | P -3 c 1 |
Hall space group symbol | -P 3 2"c |
Residual factor for all reflections | 0.1272 |
Residual factor for significantly intense reflections | 0.0994 |
Weighted residual factors for significantly intense reflections | 0.2993 |
Weighted residual factors for all reflections included in the refinement | 0.323 |
Goodness-of-fit parameter for all reflections included in the refinement | 1.147 |
Diffraction radiation wavelength | 1.54184 Å |
Diffraction radiation type | CuKα |