Information card for entry 4128047
Formula | C8 H6 Br Cu N3 |
Calculated formula | C8 H6 Br Cu N3 |
Title of publication | Elucidating the Growth of Metal-Organic Nanotubes Combining Isoreticular Synthesis with Liquid-Cell Transmission Electron Microscopy. |
Authors of publication | Vailonis, Kristina M.; Gnanasekaran, Karthikeyan; Powers, Xian B.; Gianneschi, Nathan C.; Jenkins, David M. |
Journal of publication | Journal of the American Chemical Society |
Year of publication | 2019 |
Journal volume | 141 |
Journal issue | 26 |
Pages of publication | 10177 - 10182 |
a | 22.374 ± 0.003 Å |
b | 6.9783 ± 0.0008 Å |
c | 13.2425 ± 0.0015 Å |
α | 90° |
β | 90° |
γ | 90° |
Cell volume | 2067.6 ± 0.4 Å3 |
Cell temperature | 100 ± 2 K |
Ambient diffraction temperature | 100 ± 2 K |
Number of distinct elements | 5 |
Space group number | 74 |
Hermann-Mauguin space group symbol | I m m a |
Hall space group symbol | -I 2b 2 |
Residual factor for all reflections | 0.0839 |
Residual factor for significantly intense reflections | 0.0713 |
Weighted residual factors for significantly intense reflections | 0.2193 |
Weighted residual factors for all reflections included in the refinement | 0.236 |
Goodness-of-fit parameter for all reflections included in the refinement | 1.135 |
Diffraction radiation wavelength | 0.7288 Å |
Diffraction radiation type | synchrotron |