Information card for entry 4128069
Formula | C10.51 Cl O4 |
Calculated formula | C10.506 Cl O3.9996 |
Title of publication | Directional Intermolecular Interactions for Precise Molecular Design of a High- T<sub>c</sub> Multiaxial Molecular Ferroelectric. |
Authors of publication | Yang, Chen-Kai; Chen, Wang-Nan; Ding, Yan-Ting; Wang, Jing; Rao, Yin; Liao, Wei-Qiang; Xie, Yongfa; Zou, Wennan; Xiong, Ren-Gen |
Journal of publication | Journal of the American Chemical Society |
Year of publication | 2019 |
Journal volume | 141 |
Journal issue | 4 |
Pages of publication | 1781 - 1787 |
a | 5.1525 ± 0.0013 Å |
b | 5.1525 ± 0.0013 Å |
c | 5.1525 ± 0.0013 Å |
α | 90° |
β | 90° |
γ | 90° |
Cell volume | 136.79 ± 0.06 Å3 |
Cell temperature | 473 ± 2 K |
Ambient diffraction temperature | 473 ± 2 K |
Number of distinct elements | 3 |
Space group number | 221 |
Hermann-Mauguin space group symbol | P m -3 m |
Hall space group symbol | -P 4 2 3 |
Residual factor for all reflections | 0.538 |
Residual factor for significantly intense reflections | 0.4611 |
Weighted residual factors for significantly intense reflections | 0.7753 |
Weighted residual factors for all reflections included in the refinement | 0.8084 |
Goodness-of-fit parameter for all reflections included in the refinement | 1.017 |
Diffraction radiation wavelength | 0.71073 Å |
Diffraction radiation type | MoKα |