Information card for entry 4128071
Formula | C7 H14 Cl N O4 |
Calculated formula | C9.342 Cl O3.9996 |
Title of publication | Directional Intermolecular Interactions for Precise Molecular Design of a High- T<sub>c</sub> Multiaxial Molecular Ferroelectric. |
Authors of publication | Yang, Chen-Kai; Chen, Wang-Nan; Ding, Yan-Ting; Wang, Jing; Rao, Yin; Liao, Wei-Qiang; Xie, Yongfa; Zou, Wennan; Xiong, Ren-Gen |
Journal of publication | Journal of the American Chemical Society |
Year of publication | 2019 |
Journal volume | 141 |
Journal issue | 4 |
Pages of publication | 1781 - 1787 |
a | 6.2261 ± 0.0015 Å |
b | 6.2261 ± 0.0015 Å |
c | 6.2261 ± 0.0015 Å |
α | 90° |
β | 90° |
γ | 90° |
Cell volume | 241.35 ± 0.1 Å3 |
Cell temperature | 298 ± 2 K |
Ambient diffraction temperature | 298 ± 2 K |
Number of distinct elements | 5 |
Space group number | 221 |
Hermann-Mauguin space group symbol | P m -3 m |
Hall space group symbol | -P 4 2 3 |
Residual factor for all reflections | 0.2098 |
Residual factor for significantly intense reflections | 0.1693 |
Weighted residual factors for significantly intense reflections | 0.3274 |
Weighted residual factors for all reflections included in the refinement | 0.3513 |
Goodness-of-fit parameter for all reflections included in the refinement | 1.067 |
Diffraction radiation wavelength | 0.71073 Å |
Diffraction radiation type | MoKα |