Information card for entry 4128080
Formula | C15 H17 Ag O11 |
Calculated formula | C15 H17 Ag O11 |
Title of publication | Asymmetric Counter-Anion-Directed Aminomethylation: Synthesis of Chiral β-Amino Acids via Trapping of an Enol Intermediate. |
Authors of publication | Kang, Zhenghui; Wang, Yongheng; Zhang, Dan; Wu, Ruibo; Xu, Xinfang; Hu, Wenhao |
Journal of publication | Journal of the American Chemical Society |
Year of publication | 2019 |
Journal volume | 141 |
Journal issue | 4 |
Pages of publication | 1473 - 1478 |
a | 8.8042 ± 0.0003 Å |
b | 10.5315 ± 0.0004 Å |
c | 10.8818 ± 0.0004 Å |
α | 107.99 ± 0.004° |
β | 100.432 ± 0.003° |
γ | 104.927 ± 0.004° |
Cell volume | 889.2 ± 0.07 Å3 |
Cell temperature | 293 ± 2 K |
Ambient diffraction temperature | 293 ± 2 K |
Number of distinct elements | 4 |
Space group number | 2 |
Hermann-Mauguin space group symbol | P -1 |
Hall space group symbol | -P 1 |
Residual factor for all reflections | 0.0735 |
Residual factor for significantly intense reflections | 0.0691 |
Weighted residual factors for significantly intense reflections | 0.1793 |
Weighted residual factors for all reflections included in the refinement | 0.1836 |
Goodness-of-fit parameter for all reflections included in the refinement | 1.015 |
Diffraction radiation probe | x-ray |
Diffraction radiation wavelength | 1.54184 Å |
Diffraction radiation type | CuKα |