Information card for entry 4128082
Formula | C38 H55 Ni O P2 |
Calculated formula | C38 H55 Ni O P2 |
SMILES | [Ni]1([P](c2c3Oc4c([P]1(C(C)(C)C)C(C)(C)C)cccc4C(c3ccc2)(C)C)(C(C)(C)C)C(C)(C)C)c1c(cccc1)C |
Title of publication | Mechanistic Characterization of (Xantphos)Ni(I)-Mediated Alkyl Bromide Activation: Oxidative Addition, Electron Transfer, or Halogen-Atom Abstraction. |
Authors of publication | Diccianni, Justin B.; Katigbak, Joseph; Hu, Chunhua; Diao, Tianning |
Journal of publication | Journal of the American Chemical Society |
Year of publication | 2019 |
Journal volume | 141 |
Journal issue | 4 |
Pages of publication | 1788 - 1796 |
a | 12.1143 ± 0.0009 Å |
b | 25.5397 ± 0.0019 Å |
c | 12.3372 ± 0.0009 Å |
α | 90° |
β | 114.18 ± 0.0012° |
γ | 90° |
Cell volume | 3482.2 ± 0.4 Å3 |
Cell temperature | 100 ± 2 K |
Ambient diffraction temperature | 100 ± 2 K |
Number of distinct elements | 5 |
Space group number | 14 |
Hermann-Mauguin space group symbol | P 1 21/n 1 |
Hall space group symbol | -P 2yn |
Residual factor for all reflections | 0.0727 |
Residual factor for significantly intense reflections | 0.0544 |
Weighted residual factors for significantly intense reflections | 0.1315 |
Weighted residual factors for all reflections included in the refinement | 0.141 |
Goodness-of-fit parameter for all reflections included in the refinement | 1.045 |
Diffraction radiation wavelength | 0.71073 Å |
Diffraction radiation type | MoKα |