Information card for entry 4128131
Formula | C15 H9 N2 S2 |
Calculated formula | C15 H9 N2 S2 |
SMILES | S1S[N]C(=N1)c1c2ccccc2cc2ccccc12 |
Title of publication | Structural, Magnetic, and Optical Studies of the Polymorphic 9'-Anthracenyl Dithiadiazolyl Radical. |
Authors of publication | Beldjoudi, Yassine; Arauzo, Ana; Campo, Javier; Gavey, Emma L.; Pilkington, Melanie; Nascimento, Mitchell A.; Rawson, Jeremy M. |
Journal of publication | Journal of the American Chemical Society |
Year of publication | 2019 |
Journal volume | 141 |
Journal issue | 17 |
Pages of publication | 6875 - 6889 |
a | 14.788 ± 0.014 Å |
b | 10.794 ± 0.01 Å |
c | 8.355 ± 0.008 Å |
α | 90° |
β | 97.334 ± 0.009° |
γ | 90° |
Cell volume | 1323 ± 2 Å3 |
Cell temperature | 273 ± 2 K |
Ambient diffraction temperature | 273.01 K |
Number of distinct elements | 4 |
Space group number | 14 |
Hermann-Mauguin space group symbol | P 1 21/c 1 |
Hall space group symbol | -P 2ybc |
Residual factor for all reflections | 0.1603 |
Residual factor for significantly intense reflections | 0.1107 |
Weighted residual factors for significantly intense reflections | 0.2666 |
Weighted residual factors for all reflections included in the refinement | 0.3015 |
Goodness-of-fit parameter for all reflections included in the refinement | 1.099 |
Diffraction radiation wavelength | 0.71073 Å |
Diffraction radiation type | MoKα |