Information card for entry 4128157
Formula | C26 H38 Cu N4 O8 |
Calculated formula | C26 H38 Cu N4 O8 |
SMILES | c12n(c(ccc2)CCCCCCCC1)=[O][Cu]12(ON(=[O]1)=O)([O]=n1c3cccc1CCCCCCCC3)ON(=[O]2)=O |
Title of publication | Anomalous Chromophore Disruption Enables an Eight-Step Synthesis and Stereochemical Reassignment of (+)-Marineosin A. |
Authors of publication | Feng, Zhengao; Allred, Tyler K.; Hurlow, Evan E.; Harran, Patrick G. |
Journal of publication | Journal of the American Chemical Society |
Year of publication | 2019 |
Journal volume | 141 |
Journal issue | 6 |
Pages of publication | 2274 - 2278 |
a | 10.609 ± 0.0009 Å |
b | 7.879 ± 0.0006 Å |
c | 17.4437 ± 0.0014 Å |
α | 90° |
β | 97.679 ± 0.002° |
γ | 90° |
Cell volume | 1445 ± 0.2 Å3 |
Cell temperature | 298 ± 2 K |
Ambient diffraction temperature | 298 ± 2 K |
Number of distinct elements | 5 |
Space group number | 14 |
Hermann-Mauguin space group symbol | P 1 21/c 1 |
Hall space group symbol | -P 2ybc |
Residual factor for all reflections | 0.0663 |
Residual factor for significantly intense reflections | 0.0371 |
Weighted residual factors for significantly intense reflections | 0.0994 |
Weighted residual factors for all reflections included in the refinement | 0.1119 |
Goodness-of-fit parameter for all reflections included in the refinement | 1.013 |
Diffraction radiation wavelength | 0.71073 Å |
Diffraction radiation type | MoKα |