Information card for entry 4128174
Formula | C70 H92 K Mn N11 O15 |
Calculated formula | C70 H92 K Mn N11 O15 |
Title of publication | Switchable Aromaticity in an Isostructural Mn Phthalocyanine Series Isolated in Five Separate Redox States. |
Authors of publication | Hunt, Camden; Peterson, Madeline; Anderson, Cassidy; Chang, Tieyan; Wu, Guang; Scheiner, Steve; Ménard, Gabriel |
Journal of publication | Journal of the American Chemical Society |
Year of publication | 2019 |
Journal volume | 141 |
Journal issue | 6 |
Pages of publication | 2604 - 2613 |
a | 14.123 ± 0.004 Å |
b | 15.53 ± 0.005 Å |
c | 16.283 ± 0.005 Å |
α | 78.073 ± 0.007° |
β | 80.064 ± 0.006° |
γ | 89.083 ± 0.007° |
Cell volume | 3441.1 ± 1.8 Å3 |
Cell temperature | 102 ± 2 K |
Ambient diffraction temperature | 100 ± 2 K |
Number of distinct elements | 6 |
Space group number | 2 |
Hermann-Mauguin space group symbol | P -1 |
Hall space group symbol | -P 1 |
Residual factor for all reflections | 0.2102 |
Residual factor for significantly intense reflections | 0.0818 |
Weighted residual factors for significantly intense reflections | 0.1993 |
Weighted residual factors for all reflections included in the refinement | 0.2593 |
Goodness-of-fit parameter for all reflections included in the refinement | 0.94 |
Diffraction radiation wavelength | 0.71073 Å |
Diffraction radiation type | MoKα |