Information card for entry 4129121
Formula | C30.61 H21.53 Al2 O10.25 S0.52 |
Calculated formula | C30.6096 H21.5292 Al2 O10.25 S0.5219 |
Title of publication | Coordinative Alignment in the Pores of MOFs for the Structural Determination of N-, S-, and P-Containing Organic Compounds Including Complex Chiral Molecules. |
Authors of publication | Pei, Xiaokun; Bürgi, Hans-Beat; Kapustin, Eugene A.; Liu, Yuzhong; Yaghi, Omar M. |
Journal of publication | Journal of the American Chemical Society |
Year of publication | 2019 |
Journal volume | 141 |
Journal issue | 47 |
Pages of publication | 18862 - 18869 |
a | 18.6986 ± 0.0011 Å |
b | 18.6986 ± 0.0011 Å |
c | 37.201 ± 0.003 Å |
α | 90° |
β | 90° |
γ | 90° |
Cell volume | 13006.9 ± 1.5 Å3 |
Cell temperature | 100 K |
Ambient diffraction temperature | 100 K |
Number of distinct elements | 5 |
Space group number | 94 |
Hermann-Mauguin space group symbol | P 42 21 2 |
Hall space group symbol | P 4n 2n |
Residual factor for all reflections | 0.0646 |
Residual factor for significantly intense reflections | 0.0541 |
Weighted residual factors for significantly intense reflections | 0.1465 |
Weighted residual factors for all reflections included in the refinement | 0.156 |
Goodness-of-fit parameter for all reflections included in the refinement | 1.036 |
Diffraction radiation wavelength | 0.7288 Å |
Diffraction radiation type | synchrotron |