Information card for entry 4129125
Formula | C28.72 H18.69 Al2 N2.15 O8.57 |
Calculated formula | C28.718 H18.68 Al2 N2.154 O8.564 |
Title of publication | Coordinative Alignment in the Pores of MOFs for the Structural Determination of N-, S-, and P-Containing Organic Compounds Including Complex Chiral Molecules. |
Authors of publication | Pei, Xiaokun; Bürgi, Hans-Beat; Kapustin, Eugene A.; Liu, Yuzhong; Yaghi, Omar M. |
Journal of publication | Journal of the American Chemical Society |
Year of publication | 2019 |
Journal volume | 141 |
Journal issue | 47 |
Pages of publication | 18862 - 18869 |
a | 18.9 ± 0.001 Å |
b | 18.9 ± 0.001 Å |
c | 36.682 ± 0.002 Å |
α | 90° |
β | 90° |
γ | 90° |
Cell volume | 13103.2 ± 1.2 Å3 |
Cell temperature | 100 K |
Ambient diffraction temperature | 100 K |
Number of distinct elements | 5 |
Space group number | 94 |
Hermann-Mauguin space group symbol | P 42 21 2 |
Hall space group symbol | P 4n 2n |
Residual factor for all reflections | 0.0344 |
Residual factor for significantly intense reflections | 0.0274 |
Weighted residual factors for significantly intense reflections | 0.0711 |
Weighted residual factors for all reflections included in the refinement | 0.0741 |
Goodness-of-fit parameter for all reflections included in the refinement | 0.984 |
Diffraction radiation probe | x-ray |
Diffraction radiation wavelength | 0.7288 Å |
Diffraction radiation type | synchrotron |