Information card for entry 4129134
Formula | C62.99 H67.99 B2 Cl1.99 F12 Mo2 N20 O4 |
Calculated formula | C62.9939 H67.9878 B2 Cl1.9878 F12 Mo2 N20 O4 |
Title of publication | Molybdenum-Promoted Synthesis of Isoquinuclidines with Bridgehead CF<sub>3</sub> Groups. |
Authors of publication | Wilde, Justin H.; Smith, Jacob A.; Dickie, Diane A.; Harman, W. Dean |
Journal of publication | Journal of the American Chemical Society |
Year of publication | 2019 |
Journal volume | 141 |
Journal issue | 47 |
Pages of publication | 18890 - 18899 |
a | 13.8205 ± 0.0008 Å |
b | 25.6573 ± 0.0019 Å |
c | 20.2557 ± 0.0014 Å |
α | 90° |
β | 92.501 ± 0.003° |
γ | 90° |
Cell volume | 7175.8 ± 0.8 Å3 |
Cell temperature | 100 ± 2 K |
Ambient diffraction temperature | 100 ± 2 K |
Number of distinct elements | 8 |
Space group number | 14 |
Hermann-Mauguin space group symbol | P 1 21/c 1 |
Hall space group symbol | -P 2ybc |
Residual factor for all reflections | 0.0643 |
Residual factor for significantly intense reflections | 0.0421 |
Weighted residual factors for significantly intense reflections | 0.09 |
Weighted residual factors for all reflections included in the refinement | 0.1029 |
Goodness-of-fit parameter for all reflections included in the refinement | 1.044 |
Diffraction radiation wavelength | 0.71073 Å |
Diffraction radiation type | MoKα |