Information card for entry 4129163
Chemical name | Dodecakis-[4,6-di(4-methylpyrazol-1-yl)-2-hydroxypyrimidinate]octa-iron(II) hexa-aqua-iron(III) hepta-tetrafluoroborate acetonitrile diethyl ether solvate |
Formula | C152.8 H162.4 B7 F28 Fe9 N73.8 O19.3 |
Calculated formula | C152.8 H150.4 B7 F28 Fe9 N73.8 O19.3 |
Title of publication | Supramolecular Iron Metallocubanes Exhibiting Site-Selective Thermal and Light-Induced Spin-Crossover. |
Authors of publication | Berdiell, Izar Capel; Hochdörffer, Tim; Desplanches, Cédric; Kulmaczewski, Rafal; Shahid, Namrah; Wolny, Juliusz A.; Warriner, Stuart L.; Cespedes, Oscar; Schünemann, Volker; Chastanet, Guillaume; Halcrow, Malcolm A. |
Journal of publication | Journal of the American Chemical Society |
Year of publication | 2019 |
Journal volume | 141 |
Journal issue | 47 |
Pages of publication | 18759 - 18770 |
a | 17.4969 ± 0.0005 Å |
b | 24.4003 ± 0.0011 Å |
c | 25.9749 ± 0.0005 Å |
α | 90° |
β | 98.569 ± 0.002° |
γ | 90° |
Cell volume | 10965.7 ± 0.6 Å3 |
Cell temperature | 250 ± 2 K |
Ambient diffraction temperature | 250 ± 2 K |
Number of distinct elements | 7 |
Space group number | 14 |
Hermann-Mauguin space group symbol | P 1 21/n 1 |
Hall space group symbol | -P 2yn |
Residual factor for all reflections | 0.0854 |
Residual factor for significantly intense reflections | 0.071 |
Weighted residual factors for significantly intense reflections | 0.2067 |
Weighted residual factors for all reflections included in the refinement | 0.2233 |
Goodness-of-fit parameter for all reflections included in the refinement | 1.025 |
Diffraction radiation wavelength | 1.54184 Å |
Diffraction radiation type | CuKα |