Information card for entry 4129526
Formula | C79 Co F12 N4 O23 Ru4 S4 |
Calculated formula | C79 Co F12 N4 O23 Ru4 S4 |
Title of publication | Ruthenium-Cobalt Bimetallic Supramolecular Cages via a Less Symmetric Tetrapyridyl Metalloligand and the Effect of Spacer Units. |
Authors of publication | Ryu, Ji Yeon; Park, Yu Jin; Park, Hyoung-Ryun; Saha, Manik Lal; Stang, Peter J.; Lee, Junseong |
Journal of publication | Journal of the American Chemical Society |
Year of publication | 2015 |
Journal volume | 137 |
Journal issue | 40 |
Pages of publication | 13018 - 13023 |
a | 14.472 ± 0.005 Å |
b | 25.49 ± 0.009 Å |
c | 26.207 ± 0.008 Å |
α | 90° |
β | 93.01 ± 0.02° |
γ | 90° |
Cell volume | 9654 ± 6 Å3 |
Cell temperature | 296 ± 2 K |
Ambient diffraction temperature | 296 ± 2 K |
Number of distinct elements | 7 |
Space group number | 14 |
Hermann-Mauguin space group symbol | P 1 21/n 1 |
Hall space group symbol | -P 2yn |
Residual factor for all reflections | 0.1817 |
Residual factor for significantly intense reflections | 0.1299 |
Weighted residual factors for significantly intense reflections | 0.3245 |
Weighted residual factors for all reflections included in the refinement | 0.3583 |
Goodness-of-fit parameter for all reflections included in the refinement | 2.441 |
Diffraction radiation wavelength | 0.71073 Å |
Diffraction radiation type | MoKα |