Information card for entry 4129577
Formula | C81 H138 N10 O9 |
Calculated formula | C81 H138 N10 O9 |
Title of publication | Anion-Receptor Mediated Oxidation of Carbon Monoxide to Carbonate by Peroxide Dianion. |
Authors of publication | Nava, Matthew; Lopez, Nazario; Müller, Peter; Wu, Gang; Nocera, Daniel G.; Cummins, Christopher C. |
Journal of publication | Journal of the American Chemical Society |
Year of publication | 2015 |
Journal volume | 137 |
Journal issue | 46 |
Pages of publication | 14562 - 14565 |
a | 25.0676 ± 0.0009 Å |
b | 13.6347 ± 0.0005 Å |
c | 27.5542 ± 0.0014 Å |
α | 90° |
β | 116.715 ± 0.0008° |
γ | 90° |
Cell volume | 8412.4 ± 0.6 Å3 |
Cell temperature | 100 ± 2 K |
Ambient diffraction temperature | 100 ± 2 K |
Number of distinct elements | 4 |
Space group number | 15 |
Hermann-Mauguin space group symbol | C 1 2/c 1 |
Hall space group symbol | -C 2yc |
Residual factor for all reflections | 0.0748 |
Residual factor for significantly intense reflections | 0.0584 |
Weighted residual factors for significantly intense reflections | 0.1635 |
Weighted residual factors for all reflections included in the refinement | 0.1819 |
Goodness-of-fit parameter for all reflections included in the refinement | 1.027 |
Diffraction radiation wavelength | 0.71073 Å |
Diffraction radiation type | MoKα |