Information card for entry 4129581
Formula | C20 H28 O6 |
Calculated formula | C20 H28 O6 |
Title of publication | Concise Enantioselective Synthesis of Oxygenated Steroids via Sequential Copper(II)-Catalyzed Michael Addition/Intramolecular Aldol Cyclization Reactions. |
Authors of publication | Cichowicz, Nathan R.; Kaplan, Will; Khomutnyk, Yaroslav; Bhattarai, Bijay; Sun, Zhankui; Nagorny, Pavel |
Journal of publication | Journal of the American Chemical Society |
Year of publication | 2015 |
Journal volume | 137 |
Journal issue | 45 |
Pages of publication | 14341 - 14348 |
a | 9.4116 ± 0.0002 Å |
b | 10.1451 ± 0.0002 Å |
c | 10.385 ± 0.0007 Å |
α | 87.94 ± 0.006° |
β | 66.878 ± 0.005° |
γ | 82.795 ± 0.006° |
Cell volume | 904.63 ± 0.08 Å3 |
Cell temperature | 85 ± 2 K |
Ambient diffraction temperature | 85 ± 2 K |
Number of distinct elements | 3 |
Space group number | 1 |
Hermann-Mauguin space group symbol | P 1 |
Hall space group symbol | P 1 |
Residual factor for all reflections | 0.0331 |
Residual factor for significantly intense reflections | 0.0329 |
Weighted residual factors for significantly intense reflections | 0.0862 |
Weighted residual factors for all reflections included in the refinement | 0.0864 |
Goodness-of-fit parameter for all reflections included in the refinement | 0.962 |
Diffraction radiation wavelength | 1.54178 Å |
Diffraction radiation type | CuKα |