Information card for entry 4129593
Common name | holcc06 |
Formula | C29 H43 Cl2 Co Li N2 O2 |
Calculated formula | C22.248 H27.808 Cl2 Co Li N2 O0.312 |
Title of publication | Rapid, Regioconvergent, Solvent-Free Alkene Hydrosilylation with a Cobalt Catalyst. |
Authors of publication | Chen, Chi; Hecht, Maxwell B.; Kavara, Aydin; Brennessel, William W.; Mercado, Brandon Q.; Weix, Daniel J.; Holland, Patrick L. |
Journal of publication | Journal of the American Chemical Society |
Year of publication | 2015 |
Journal volume | 137 |
Journal issue | 41 |
Pages of publication | 13244 - 13247 |
a | 8.562 ± 0.0016 Å |
b | 14.607 ± 0.003 Å |
c | 24.304 ± 0.005 Å |
α | 90° |
β | 92.187 ± 0.004° |
γ | 90° |
Cell volume | 3037.4 ± 1 Å3 |
Cell temperature | 100 ± 0.5 K |
Ambient diffraction temperature | 100 ± 0.5 K |
Number of distinct elements | 7 |
Space group number | 14 |
Hermann-Mauguin space group symbol | P 1 21/n 1 |
Hall space group symbol | -P 2yn |
Residual factor for all reflections | 0.094 |
Residual factor for significantly intense reflections | 0.0509 |
Weighted residual factors for significantly intense reflections | 0.1104 |
Weighted residual factors for all reflections included in the refinement | 0.1263 |
Goodness-of-fit parameter for all reflections included in the refinement | 1.035 |
Diffraction radiation wavelength | 0.71073 Å |
Diffraction radiation type | MoKα |