Information card for entry 4129599
Formula | C43 H40 I2 N Ni O P |
Calculated formula | C43 H40 I2 N Ni O P |
SMILES | c12c(c(cc(c1)I)I)O[Ni](c1ccccc1)([N](=C2)c1c(cccc1C(C)C)C(C)C)[P](c1ccccc1)(c1ccccc1)c1ccccc1 |
Title of publication | Role of Radical Species in Salicylaldiminato Ni(II) Mediated Polymer Chain Growth: A Case Study for the Migratory Insertion Polymerization of Ethylene in the Presence of Methyl Methacrylate. |
Authors of publication | Ölscher, Franz; Göttker-Schnetmann, Inigo; Monteil, Vincent; Mecking, Stefan |
Journal of publication | Journal of the American Chemical Society |
Year of publication | 2015 |
Journal volume | 137 |
Journal issue | 46 |
Pages of publication | 14819 - 14828 |
a | 11.7972 ± 0.0004 Å |
b | 28.2682 ± 0.0008 Å |
c | 13.0939 ± 0.0004 Å |
α | 90° |
β | 99.384 ± 0.003° |
γ | 90° |
Cell volume | 4308.2 ± 0.2 Å3 |
Cell temperature | 100 ± 2 K |
Ambient diffraction temperature | 100.15 K |
Number of distinct elements | 7 |
Space group number | 14 |
Hermann-Mauguin space group symbol | P 1 21/a 1 |
Hall space group symbol | -P 2yab |
Residual factor for all reflections | 0.0281 |
Residual factor for significantly intense reflections | 0.0237 |
Weighted residual factors for significantly intense reflections | 0.0529 |
Weighted residual factors for all reflections included in the refinement | 0.0543 |
Goodness-of-fit parameter for all reflections included in the refinement | 1.036 |
Diffraction radiation wavelength | 0.71073 Å |
Diffraction radiation type | MoKα |