Information card for entry 4129611
Formula | C88 H136 F24 Ir4 N20 O42 Pd4 S12 |
Calculated formula | C84 H104 F24 Ir4 N20 O34 Pd4 S12 |
Title of publication | Rational Design of Polynuclear Organometallic Assemblies from a Simple Heteromultifunctional Ligand. |
Authors of publication | Zhang, Long; Lin, Yue-Jian; Li, Zhen-Hua; Jin, Guo-Xin |
Journal of publication | Journal of the American Chemical Society |
Year of publication | 2015 |
Journal volume | 137 |
Journal issue | 42 |
Pages of publication | 13670 - 13678 |
a | 16.111 ± 0.002 Å |
b | 16.673 ± 0.002 Å |
c | 16.744 ± 0.002 Å |
α | 61.135 ± 0.002° |
β | 63.658 ± 0.002° |
γ | 73.515 ± 0.002° |
Cell volume | 3516 ± 0.7 Å3 |
Cell temperature | 173 ± 2 K |
Ambient diffraction temperature | 173 ± 2 K |
Number of distinct elements | 8 |
Space group number | 2 |
Hermann-Mauguin space group symbol | P -1 |
Hall space group symbol | -P 1 |
Residual factor for all reflections | 0.1164 |
Residual factor for significantly intense reflections | 0.0626 |
Weighted residual factors for significantly intense reflections | 0.1673 |
Weighted residual factors for all reflections included in the refinement | 0.2014 |
Goodness-of-fit parameter for all reflections included in the refinement | 0.964 |
Diffraction radiation wavelength | 0.71073 Å |
Diffraction radiation type | MoKα |