Information card for entry 4129614
Formula | C158 H198 Cl12 F24 N16 O35 Rh8 S8 |
Calculated formula | C145 H166 Cl10 F24 N16 O32 Rh8 S8 |
Title of publication | Rational Design of Polynuclear Organometallic Assemblies from a Simple Heteromultifunctional Ligand. |
Authors of publication | Zhang, Long; Lin, Yue-Jian; Li, Zhen-Hua; Jin, Guo-Xin |
Journal of publication | Journal of the American Chemical Society |
Year of publication | 2015 |
Journal volume | 137 |
Journal issue | 42 |
Pages of publication | 13670 - 13678 |
a | 41.671 ± 0.004 Å |
b | 17.4453 ± 0.0018 Å |
c | 27.235 ± 0.003 Å |
α | 90° |
β | 90° |
γ | 90° |
Cell volume | 19799 ± 4 Å3 |
Cell temperature | 173 ± 2 K |
Ambient diffraction temperature | 173 ± 2 K |
Number of distinct elements | 8 |
Space group number | 29 |
Hermann-Mauguin space group symbol | P c a 21 |
Hall space group symbol | P 2c -2ac |
Residual factor for all reflections | 0.1016 |
Residual factor for significantly intense reflections | 0.0659 |
Weighted residual factors for significantly intense reflections | 0.1529 |
Weighted residual factors for all reflections included in the refinement | 0.1684 |
Goodness-of-fit parameter for all reflections included in the refinement | 0.995 |
Diffraction radiation wavelength | 0.71073 Å |
Diffraction radiation type | MoKα |