Information card for entry 4131810
Formula | C46 H28 Au2 F6 P2 |
Calculated formula | C46 H28 Au2 F6 P2 |
Title of publication | Phosphorescence Control Mediated by Molecular Rotation and Aurophilic Interactions in Amphidynamic Crystals of 1,4-Bis[tri-(p-fluorophenyl)phosphane-gold(I)-ethynyl]benzene. |
Authors of publication | Jin, Mingoo; Chung, Tim S.; Seki, Tomohiro; Ito, Hajime; Garcia-Garibay, Miguel A |
Journal of publication | Journal of the American Chemical Society |
Year of publication | 2017 |
Journal volume | 139 |
Journal issue | 49 |
Pages of publication | 18115 - 18121 |
a | 11.9564 ± 0.0013 Å |
b | 14.1676 ± 0.0017 Å |
c | 14.2228 ± 0.0015 Å |
α | 69.048 ± 0.003° |
β | 67.782 ± 0.003° |
γ | 65.55 ± 0.004° |
Cell volume | 1971.7 ± 0.4 Å3 |
Cell temperature | 193 K |
Ambient diffraction temperature | 193 K |
Number of distinct elements | 5 |
Space group number | 2 |
Hermann-Mauguin space group symbol | P -1 |
Hall space group symbol | -P 1 |
Residual factor for all reflections | 0.2031 |
Residual factor for significantly intense reflections | 0.0929 |
Weighted residual factors for significantly intense reflections | 0.2329 |
Weighted residual factors for all reflections included in the refinement | 0.3064 |
Goodness-of-fit parameter for all reflections included in the refinement | 1.079 |
Diffraction radiation wavelength | 0.71075 Å |
Diffraction radiation type | MoKα |