Information card for entry 4132188
Formula | C5 Cd0.12 Cl0.25 Dy0.25 F0.5 N0.5 O1.33 |
Calculated formula | C5 Cd0.125 Cl0.25 Dy0.25 F0.5 N0.5 O1.33333 |
Title of publication | Programmable Topology in New Families of Heterobimetallic Metal-Organic Frameworks. |
Authors of publication | Muldoon, Patrick F.; Liu, Chong; Miller, Carson C.; Koby, S. Benjamin; Gamble Jarvi, Austin; Luo, Tian-Yi; Saxena, Sunil; O'Keeffe, Michael; Rosi, Nathaniel L. |
Journal of publication | Journal of the American Chemical Society |
Year of publication | 2018 |
Journal volume | 140 |
Journal issue | 20 |
Pages of publication | 6194 - 6198 |
a | 16.0403 ± 0.0007 Å |
b | 16.0403 ± 0.0007 Å |
c | 16.0403 ± 0.0007 Å |
α | 90° |
β | 90° |
γ | 90° |
Cell volume | 4127 ± 0.3 Å3 |
Cell temperature | 230 ± 2 K |
Ambient diffraction temperature | 230 K |
Number of distinct elements | 7 |
Space group number | 221 |
Hermann-Mauguin space group symbol | P m -3 m |
Hall space group symbol | -P 4 2 3 |
Residual factor for all reflections | 0.0631 |
Residual factor for significantly intense reflections | 0.0615 |
Weighted residual factors for significantly intense reflections | 0.2203 |
Weighted residual factors for all reflections included in the refinement | 0.2268 |
Goodness-of-fit parameter for all reflections included in the refinement | 1.258 |
Diffraction radiation wavelength | 1.54178 Å |
Diffraction radiation type | CuKα |