Information card for entry 4132215
Formula | C15 H14 N2 O5 |
Calculated formula | C15 H14 N2 O5 |
SMILES | O.c1(ccc(cc1)O)C(=O)N.c1(cc(ccc1)C#N)C(=O)O |
Title of publication | Acid···Amide Supramolecular Synthon in Cocrystals: From Spectroscopic Detection to Property Engineering. |
Authors of publication | Saha, Subhankar; Desiraju, Gautam R. |
Journal of publication | Journal of the American Chemical Society |
Year of publication | 2018 |
Journal volume | 140 |
Journal issue | 20 |
Pages of publication | 6361 - 6373 |
a | 7.55 ± 0.008 Å |
b | 16.276 ± 0.016 Å |
c | 11.939 ± 0.012 Å |
α | 90° |
β | 98.124 ± 0.014° |
γ | 90° |
Cell volume | 1452 ± 3 Å3 |
Cell temperature | 296 ± 2 K |
Ambient diffraction temperature | 296 ± 2 K |
Number of distinct elements | 4 |
Space group number | 14 |
Hermann-Mauguin space group symbol | P 1 21/n 1 |
Hall space group symbol | -P 2yn |
Residual factor for all reflections | 0.0738 |
Residual factor for significantly intense reflections | 0.0637 |
Weighted residual factors for significantly intense reflections | 0.1711 |
Weighted residual factors for all reflections included in the refinement | 0.1857 |
Goodness-of-fit parameter for all reflections included in the refinement | 1.134 |
Diffraction radiation wavelength | 0.71073 Å |
Diffraction radiation type | MoKα |