Information card for entry 4132254
Formula | C18 H15 I3 P S |
Calculated formula | C18 H15 I3 P S |
Title of publication | Enantioselective Halo-oxy- and Halo-azacyclizations Induced by Chiral Amidophosphate Catalysts and Halo-Lewis Acids. |
Authors of publication | Lu, Yanhui; Nakatsuji, Hidefumi; Okumura, Yukimasa; Yao, Lu; Ishihara, Kazuaki |
Journal of publication | Journal of the American Chemical Society |
Year of publication | 2018 |
Journal volume | 140 |
Journal issue | 19 |
Pages of publication | 6039 - 6043 |
a | 8.848 ± 0.0019 Å |
b | 9.559 ± 0.002 Å |
c | 12.435 ± 0.003 Å |
α | 84.477 ± 0.011° |
β | 74.428 ± 0.008° |
γ | 81.055 ± 0.01° |
Cell volume | 999.2 ± 0.4 Å3 |
Cell temperature | 123 K |
Ambient diffraction temperature | 123 K |
Number of distinct elements | 5 |
Space group number | 2 |
Hermann-Mauguin space group symbol | P -1 |
Hall space group symbol | -P 1 |
Residual factor for all reflections | 0.0698 |
Residual factor for significantly intense reflections | 0.0673 |
Weighted residual factors for significantly intense reflections | 0.1826 |
Weighted residual factors for all reflections included in the refinement | 0.1846 |
Goodness-of-fit parameter for all reflections included in the refinement | 1.049 |
Diffraction radiation wavelength | 0.71075 Å |
Diffraction radiation type | MoKα |