Information card for entry 4132399
Common name | Fe(tri)2 |
Formula | C48 H48 Fe12 N72 |
Calculated formula | C48 H48 Fe12 N72 |
Title of publication | Charge Delocalization and Bulk Electronic Conductivity in the Mixed-Valence Metal-Organic Framework Fe(1,2,3-triazolate)<sub>2</sub>(BF<sub>4</sub>) <sub>x</sub>. |
Authors of publication | Park, Jesse G.; Aubrey, Michael L.; Oktawiec, Julia; Chakarawet, Khetpakorn; Darago, Lucy E.; Grandjean, Fernande; Long, Gary J.; Long, Jeffrey R. |
Journal of publication | Journal of the American Chemical Society |
Year of publication | 2018 |
Journal volume | 140 |
Journal issue | 27 |
Pages of publication | 8526 - 8534 |
a | 16.65075 ± 0.00017 Å |
b | 16.65075 ± 0.00017 Å |
c | 16.65075 ± 0.00017 Å |
α | 90° |
β | 90° |
γ | 90° |
Cell volume | 4616.38 ± 0.08 Å3 |
Cell temperature | 300 K |
Ambient diffraction temperature | 300 K |
Number of distinct elements | 4 |
Space group number | 227 |
Hermann-Mauguin space group symbol | F d -3 m :2 |
Hall space group symbol | -F 4vw 2vw 3 |
Residual factor R(I) for significantly intense reflections | 0.007 |
Goodness-of-fit parameter for all reflections | 2.368 |
Method of determination | powder diffraction |
Diffraction radiation probe | x-ray |
Diffraction radiation wavelength | 0.45241 Å |
Diffraction radiation type | synchrotron |