Information card for entry 4132555
Formula | C55 H91 Fe K N2 O8 |
Calculated formula | C55 H91 Fe K N2 O8 |
Title of publication | Effects of N<sub>2</sub> Binding Mode on Iron-Based Functionalization of Dinitrogen to Form an Iron(III) Hydrazido Complex. |
Authors of publication | McWilliams, Sean F.; Bill, Eckhard; Lukat-Rodgers, Gudrun; Rodgers, Kenton R.; Mercado, Brandon Q.; Holland, Patrick L. |
Journal of publication | Journal of the American Chemical Society |
Year of publication | 2018 |
Journal volume | 140 |
Journal issue | 27 |
Pages of publication | 8586 - 8598 |
a | 17.543 ± 0.0012 Å |
b | 16.6901 ± 0.0012 Å |
c | 20.3235 ± 0.0014 Å |
α | 90° |
β | 107.336 ± 0.001° |
γ | 90° |
Cell volume | 5680.3 ± 0.7 Å3 |
Cell temperature | 93 ± 2 K |
Ambient diffraction temperature | 93 ± 2 K |
Number of distinct elements | 6 |
Space group number | 14 |
Hermann-Mauguin space group symbol | P 1 21/n 1 |
Hall space group symbol | -P 2yn |
Residual factor for all reflections | 0.1103 |
Residual factor for significantly intense reflections | 0.0916 |
Weighted residual factors for significantly intense reflections | 0.2632 |
Weighted residual factors for all reflections included in the refinement | 0.2826 |
Goodness-of-fit parameter for all reflections included in the refinement | 1.054 |
Diffraction radiation wavelength | 1.54178 Å |
Diffraction radiation type | CuKα |