Information card for entry 4132586
Formula | C59 H86 Co K N O Si |
Calculated formula | C59 H95 Co K N O Si |
Title of publication | A Highly-Reduced Cobalt Terminal Carbyne: Divergent Metal- and α-Carbon-Centered Reactivity. |
Authors of publication | Mokhtarzadeh, Charles C.; Moore, Curtis E.; Rheingold, Arnold L.; Figueroa, Joshua S. |
Journal of publication | Journal of the American Chemical Society |
Year of publication | 2018 |
Journal volume | 140 |
Journal issue | 26 |
Pages of publication | 8100 - 8104 |
a | 12.4898 ± 0.0004 Å |
b | 12.5227 ± 0.0004 Å |
c | 20.6102 ± 0.0006 Å |
α | 93.054 ± 0.001° |
β | 104.868 ± 0.001° |
γ | 110.926 ± 0.001° |
Cell volume | 2872.39 ± 0.16 Å3 |
Cell temperature | 100 ± 2 K |
Ambient diffraction temperature | 100 K |
Number of distinct elements | 7 |
Space group number | 2 |
Hermann-Mauguin space group symbol | P -1 |
Hall space group symbol | -P 1 |
Residual factor for all reflections | 0.0503 |
Residual factor for significantly intense reflections | 0.0382 |
Weighted residual factors for significantly intense reflections | 0.1001 |
Weighted residual factors for all reflections included in the refinement | 0.108 |
Goodness-of-fit parameter for all reflections included in the refinement | 1.029 |
Diffraction radiation probe | x-ray |
Diffraction radiation wavelength | 0.71073 Å |
Diffraction radiation type | MoKα |