Information card for entry 4132635
Chemical name | UiO-67 |
Formula | C64.5 H41 O28.5 Zr6 |
Calculated formula | C64.716 H40.96 O32 Zr6 |
Title of publication | Impact of Disordered Guest-Framework Interactions on the Crystallography of Metal-Organic Frameworks. |
Authors of publication | Lee, Seungkyu; Bürgi, Hans-Beat; Alshmimri, Sultan A.; Yaghi, Omar M. |
Journal of publication | Journal of the American Chemical Society |
Year of publication | 2018 |
Journal volume | 140 |
Journal issue | 28 |
Pages of publication | 8958 - 8964 |
a | 26.8422 ± 0.0006 Å |
b | 26.8422 ± 0.0006 Å |
c | 26.8422 ± 0.0006 Å |
α | 90° |
β | 90° |
γ | 90° |
Cell volume | 19339.9 ± 0.7 Å3 |
Cell temperature | 260.15 K |
Ambient diffraction temperature | 260.15 K |
Number of distinct elements | 4 |
Space group number | 225 |
Hermann-Mauguin space group symbol | F m -3 m |
Hall space group symbol | -F 4 2 3 |
Residual factor for all reflections | 0.0303 |
Residual factor for significantly intense reflections | 0.026 |
Weighted residual factors for significantly intense reflections | 0.0719 |
Weighted residual factors for all reflections included in the refinement | 0.0737 |
Goodness-of-fit parameter for all reflections included in the refinement | 1.181 |
Diffraction radiation probe | x-ray |
Diffraction radiation wavelength | 1.54178 Å |
Diffraction radiation type | CuKα |